Target
Amine oxidase [flavin-containing] A
Ligand
BDBM50155427
Substrate
Meas. Tech.
ChEMBL_304820 (CHEMBL827909)
IC50
4500±n/a nM
Citation
 Núñez, MBMaguna, FPOkulik, NBCastro, EA QSAR modeling of the MAO inhibitory activity of xanthones derivatives. Bioorg Med Chem Lett 14:5611-7 (2004)  
Target
Name:
Amine oxidase [flavin-containing] A
Synonyms:
AOFA_HUMAN MAO-A Monoamine oxidase Monoamine oxidase type A (MAO A) Monoamine oxidase type A (MAOA)
Type:
Protein
Mol. Mass.:
59689.53
Organism:
Homo sapiens (Human)
Description:
P21397
Residue:
527
  
Inhibitor
Name:
BDBM50155427
Synonyms:
3,5-Dihydroxy-xanthen-9-one | CHEMBL185788
Type:
Small organic molecule
Emp. Form.:
C13H8O4
Mol. Mass.:
228.2002
SMILES:
Oc1ccc2c(c1)oc1c(O)cccc1c2=O
: