Target
Adenosylhomocysteinase
Ligand
BDBM50155463
Substrate
Meas. Tech.
ChEMBL_305768 (CHEMBL827105)
IC50
12680±n/a nM
Citation
 Moon, HRLee, HJKim, KRLee, KMLee, SKKim, HOChun, MWJeong, LS Synthesis of 5'-substituted fluoro-neplanocin A analogues: importance of a hydrogen bonding donor at 5'-position for the inhibitory activity of S-adenosylhomocysteine hydrolase. Bioorg Med Chem Lett 14:5641-4 (2004)  
Target
Name:
Adenosylhomocysteinase
Synonyms:
AHCY SAHH | SAHH_HUMAN
Type:
PROTEIN
Mol. Mass.:
47714.06
Organism:
Homo sapiens (Human)
Description:
ChEMBL_1507791
Residue:
432
  
Inhibitor
Name:
BDBM50155463
Synonyms:
(1S,2R,5S)-3-Aminomethyl-5-(6-amino-purin-9-yl)-4-fluoro-cyclopent-3-ene-1,2-diol | CHEMBL187650
Type:
Small organic molecule
Emp. Form.:
C11H13FN6O2
Mol. Mass.:
280.2583
SMILES:
NCC1=C(F)[C@H]([C@H](O)[C@@H]1O)n1cnc2c(N)ncnc12
: