Target
Integrin alpha-V/beta-3
Ligand
BDBM50155810
Substrate
Meas. Tech.
ChEMBL_305552 (CHEMBL828571)
IC50
0.700±n/a nM
Citation
 Ghosh, SSantulli, RJKinney, WADecorte, BLLiu, LLewis, JMProost, JCLeo, GCMasucci, JHageman, WEThompson, ASChen, IKawahama, RTuman, RWGalemmo, RAJohnson, DLDamiano, BPMaryanoff, BE 1,2,3,4-Tetrahydroquinoline-containing alphaVbeta3 integrin antagonists with enhanced oral bioavailability. Bioorg Med Chem Lett 14:5937-41 (2004)  
Target
Name:
Integrin alpha-V/beta-3
Synonyms:
ITGAV/ITGB3 | Integrin beta-3/Vitronectin receptor alpha
Type:
Enzyme
Mol. Mass.:
Description:
Components:
This complex has 2 components.
Component 1
Name:
Integrin alpha-V
Synonyms:
ITAV_HUMAN Integrin alpha-V/alpha-5 VNRA Vitronectin receptor | Vitronectin receptor subunit alpha
Type:
PROTEIN
Mol. Mass.:
116024.92
Organism:
Homo sapiens (Human)
Description:
ChEMBL_582336
Residue:
1048
  
Component 2
Name:
Integrin beta-3
Synonyms:
CD_antigen=CD61 GPIIIa ITGB3 Platelet membrane glycoprotein IIIa
Type:
Protein
Mol. Mass.:
87038.91
Organism:
Homo sapiens (Human)
Description:
P05106
Residue:
788
  
Inhibitor
Name:
BDBM50155810
Synonyms:
(R)-3-(6-Methoxy-pyridin-3-yl)-4-[1-(3-5,6,7,8-tetrahydro-[1,8]naphthyridin-2-yl-propionyl)-piperidin-4-yl]-butyric acid | CHEMBL186206
Type:
Small organic molecule
Emp. Form.:
C26H34N4O4
Mol. Mass.:
466.5726
SMILES:
COc1ccc(cn1)[C@H](CC1CCN(CC1)C(=O)CCc1ccc2CCCNc2n1)CC(O)=O
: