Target
Androgen receptor
Ligand
BDBM50156515
Substrate
Meas. Tech.
ChEMBL_303250 (CHEMBL826376)
Ki
5±n/a nM
Citation
 Balog, ASalvati, MEShan, WMathur, ALeith, LWWei, DDAttar, RMGeng, JRizzo, CAWang, CKrystek, SRTokarski, JSHunt, JTGottardis, MWeinmann, R The synthesis and evaluation of [2.2.1]-bicycloazahydantoins as androgen receptor antagonists. Bioorg Med Chem Lett 14:6107-11 (2004)  
Target
Name:
Androgen receptor
Synonyms:
ANDR_HUMAN Androgen Receptor Androgen receptor/Baculoviral IAP repeat-containing protein 2 Dihydrotestosterone receptor Nuclear receptor subfamily 3 group C member 4
Type:
Receptor
Mol. Mass.:
99185.27
Organism:
Homo sapiens (Human)
Description:
CHO cells were stably transfected with human AR gene.
Residue:
920
  
Inhibitor
Name:
BDBM50156515
Synonyms:
(1R,2R,6S,7S)-4-(4-Nitro-3-trifluoromethyl-phenyl)-4-aza-tricyclo[5.2.1.0*2,6*]decane-3,5-dione | CHEMBL188297
Type:
Small organic molecule
Emp. Form.:
C16H13F3N2O4
Mol. Mass.:
354.2806
SMILES:
Oc1c2[C@H]3CC[C@H](C3)c2c(O)n1-c1ccc(c(c1)C(F)(F)F)[N+]([O-])=O
: