Target
Matrix metalloproteinase-9
Ligand
BDBM50156721
Substrate
Meas. Tech.
ChEMBL_429670 (CHEMBL919964)
IC50
>10000±n/a nM
Citation
 Venkatesan, AMDavis, JMGrosu, GTBaker, JZask, ALevin, JIEllingboe, JSkotnicki, JSDijoseph, JFSung, AJin, GXu, WMcCarthy, DJBarone, D Synthesis and structure-activity relationships of 4-alkynyloxy phenyl sulfanyl, sulfinyl, and sulfonyl alkyl hydroxamates as tumor necrosis factor-alpha converting enzyme and matrix metalloproteinase inhibitors. J Med Chem 47:6255-69 (2004)  
Target
Name:
Matrix metalloproteinase-9
Synonyms:
67 kDa matrix metalloproteinase-9 92 kDa gelatinase CLG4B Gelatinase B MMP9 Matrix metalloproteinase 9 (MMP-9) Matrix metalloproteinase-9 (MMP9)
Type:
Enzyme
Mol. Mass.:
78452.28
Organism:
Homo sapiens (Human)
Description:
P14780
Residue:
707
  
Inhibitor
Name:
BDBM50156721
Synonyms:
2-{[4-(2-butynyloxy)phenyl]sulfanyl}-N-hydroxy-2-(4-methoxyphenyl)acetamide | CHEMBL373438
Type:
Small organic molecule
Emp. Form.:
C19H19NO4S
Mol. Mass.:
357.423
SMILES:
COc1ccc(cc1)C(Sc1ccc(OCC#CC)cc1)C(=O)NO
: