Target
Disintegrin and metalloproteinase domain-containing protein 17
Ligand
BDBM50156721
Substrate
Meas. Tech.
ChEMBL_429674 (CHEMBL919968)
IC50
50±n/a nM
Citation
 Venkatesan, AMDavis, JMGrosu, GTBaker, JZask, ALevin, JIEllingboe, JSkotnicki, JSDijoseph, JFSung, AJin, GXu, WMcCarthy, DJBarone, D Synthesis and structure-activity relationships of 4-alkynyloxy phenyl sulfanyl, sulfinyl, and sulfonyl alkyl hydroxamates as tumor necrosis factor-alpha converting enzyme and matrix metalloproteinase inhibitors. J Med Chem 47:6255-69 (2004)  
Target
Name:
Disintegrin and metalloproteinase domain-containing protein 17
Synonyms:
ADA17_HUMAN CSVP Disintegrin and metalloproteinase domain-containing protein 17 (ADAM17) TNF-alpha convertase TNF-alpha-converting enzyme (TACE) Tumor necrosis factor-α converting enzyme (TACE)
Type:
Enzyme
Mol. Mass.:
93007.89
Organism:
Homo sapiens (Human)
Description:
Residue:
824
  
Inhibitor
Name:
BDBM50156721
Synonyms:
2-{[4-(2-butynyloxy)phenyl]sulfanyl}-N-hydroxy-2-(4-methoxyphenyl)acetamide | CHEMBL373438
Type:
Small organic molecule
Emp. Form.:
C19H19NO4S
Mol. Mass.:
357.423
SMILES:
COc1ccc(cc1)C(Sc1ccc(OCC#CC)cc1)C(=O)NO
: