Target
Trypsin
Ligand
BDBM50157087
Substrate
Meas. Tech.
ChEMBL_302473 (CHEMBL826338)
Ki
54.0±n/a nM
Citation
 Bruncko, MMcClellan, WJWendt, MDSauer, DRGeyer, ADalton, CRKaminski, MAWeitzberg, MGong, JDellaria, JFMantei, RZhao, XNienaber, VLStewart, KKlinghofer, VBouska, JRockway, TWGiranda, VL Naphthamidine urokinase plasminogen activator inhibitors with improved pharmacokinetic properties. Bioorg Med Chem Lett 15:93-8 (2004)  
Target
Name:
Trypsin
Synonyms:
TRYP_PIG
Type:
PROTEIN
Mol. Mass.:
24411.24
Organism:
Sus scrofa
Description:
ChEMBL_1450738
Residue:
231
  
Inhibitor
Name:
BDBM50157087
Synonyms:
6-(2-Phenyl-cyclopropyl)-8-(pyrimidin-2-ylamino)-naphthalene-2-carboxamidine CHEMBL182959
Type:
Small organic molecule
Emp. Form.:
C24H21N5
Mol. Mass.:
379.457
SMILES:
NC(=N)c1ccc2cc(cc(Nc3ncccn3)c2c1)C1CC1c1ccccc1
: