Target
Urokinase-type plasminogen activator
Ligand
BDBM50157098
Substrate
Meas. Tech.
ChEMBL_302922 (CHEMBL830381)
Ki
65±n/a nM
Citation
 Bruncko, MMcClellan, WJWendt, MDSauer, DRGeyer, ADalton, CRKaminski, MAWeitzberg, MGong, JDellaria, JFMantei, RZhao, XNienaber, VLStewart, KKlinghofer, VBouska, JRockway, TWGiranda, VL Naphthamidine urokinase plasminogen activator inhibitors with improved pharmacokinetic properties. Bioorg Med Chem Lett 15:93-8 (2004)  
Target
Name:
Urokinase-type plasminogen activator
Synonyms:
PLAU UROK_HUMAN Urokinase-type plasminogen activator (uPA) | Urokinase-type plasminogen activator/surface receptor
Type:
Enzyme
Mol. Mass.:
48528.62
Organism:
Homo sapiens (Human)
Description:
P00749
Residue:
431
  
Inhibitor
Name:
BDBM50157098
Synonyms:
6-[2-((S)-1-Isopropyl-3,4-dihydro-isoquinolin-7-yl)-cyclopropyl]-naphthalene-2-carboxamidine | CHEMBL183021
Type:
Small organic molecule
Emp. Form.:
C26H27N3
Mol. Mass.:
381.5127
SMILES:
CC(C)C1=NCCc2ccc(cc12)[C@H]1CC1c1ccc2cc(ccc2c1)C(N)=N
: