Target
B1 bradykinin receptor
Ligand
BDBM50157518
Substrate
Meas. Tech.
ChEMBL_429974 (CHEMBL917704)
IC50
1.5±n/a nM
Citation
 Kuduk, SDNg, CFeng, DMWai, JMChang, RSHarrell, CMMurphy, KLRansom, RWReiss, DIvarsson, MMason, GBoyce, STang, CPrueksaritanont, TFreidinger, RMPettibone, DJBock, MG 2,3-diaminopyridine bradykinin B1 receptor antagonists. J Med Chem 47:6439-42 (2004)  
Target
Name:
B1 bradykinin receptor
Synonyms:
B1 BRADYKININ B1R BK-1 receptor BRADYB1 | Bradykinin B1 receptor
Type:
Enzyme
Mol. Mass.:
40508.87
Organism:
Homo sapiens (Human)
Description:
P46663
Residue:
353
  
Inhibitor
Name:
BDBM50157518
Synonyms:
5-chloro-4'-{(R)-1-[4-chloro-3-(2-cyano-acetylamino)-pyridin-2-ylamino]-ethyl}-biphenyl-2-carboxylic acid methyl ester | CHEMBL375288
Type:
Small organic molecule
Emp. Form.:
C24H20Cl2N4O3
Mol. Mass.:
483.347
SMILES:
COC(=O)c1ccc(Cl)cc1-c1ccc(cc1)[C@@H](C)Nc1nccc(Cl)c1NC(=O)CC#N
: