Target
Androgen receptor
Ligand
BDBM50157825
Substrate
Meas. Tech.
ChEMBL_303055 (CHEMBL828881)
Ki
2±n/a nM
Citation
 Salvati, MEBalog, AWei, DDPickering, DAttar, RMGeng, JRizzo, CAHunt, JTGottardis, MMWeinmann, RMartinez, R Identification of a novel class of androgen receptor antagonists based on the bicyclic-1H-isoindole-1,3(2H)-dione nucleus. Bioorg Med Chem Lett 15:389-93 (2004)  
Target
Name:
Androgen receptor
Synonyms:
ANDR_HUMAN Androgen Receptor Androgen receptor/Baculoviral IAP repeat-containing protein 2 Dihydrotestosterone receptor Nuclear receptor subfamily 3 group C member 4
Type:
Receptor
Mol. Mass.:
99185.27
Organism:
Homo sapiens (Human)
Description:
CHO cells were stably transfected with human AR gene.
Residue:
920
  
Inhibitor
Name:
BDBM50157825
Synonyms:
(2R,6S)-4-(4-Nitro-3-trifluoromethyl-phenyl)-4-aza-tricyclo[5.2.1.0*2,6*]decane-3,5-dione (2S,6R)-4-(4-Nitro-3-trifluoromethyl-phenyl)-4-aza-tricyclo[5.2.1.0*2,6*]decane-3,5-dione | CHEMBL178333
Type:
Small organic molecule
Emp. Form.:
C16H13F3N2O4
Mol. Mass.:
354.2806
SMILES:
Oc1c2C3CCC(C3)c2c(O)n1-c1ccc(c(c1)C(F)(F)F)[N+]([O-])=O
: