Target
Prostaglandin G/H synthase 1
Ligand
BDBM11639
Substrate
Meas. Tech.
ChEMBL_430457 (CHEMBL916301)
IC50
2600±n/a nM
Citation
 Julémont, Fde Leval, XMichaux, CRenard, JFWinum, JYMontero, JLDamas, JDogné, JMPirotte, B Design, synthesis, and pharmacological evaluation of pyridinic analogues of nimesulide as cyclooxygenase-2 selective inhibitors. J Med Chem 47:6749-59 (2004)  
Target
Name:
Prostaglandin G/H synthase 1
Synonyms:
COX-1 Cyclooxygenase Cyclooxygenase-1 (COX-1) PTGS1 | Prostaglandin G/H synthase (cyclooxygenase)
Type:
Enzyme
Mol. Mass.:
68692.62
Organism:
Homo sapiens (Human)
Description:
P23219
Residue:
599
  
Inhibitor
Name:
BDBM11639
Synonyms:
4-[5-(4-methylphenyl)-3-(trifluoromethyl)-1H-pyrazol-1-yl]benzene-1-sulfonamide CLX Celecoxib US11478464, Compound Celecoxib US8741944, Comparative Compound cid_2662
Type:
Small organic molecule
Emp. Form.:
C17H14F3N3O2S
Mol. Mass.:
381.372
SMILES:
Cc1ccc(cc1)-c1cc(nn1-c1ccc(cc1)S(N)(=O)=O)C(F)(F)F
: