Target
Adenosine receptor A3
Ligand
BDBM50109462
Substrate
Meas. Tech.
ChEMBL_302754 (CHEMBL838701)
Ki
0.29±n/a nM
Citation
 Moro, SBraiuca, PDeflorian, FFerrari, CPastorin, GCacciari, BBaraldi, PGVarani, KBorea, PASpalluto, G Combined target-based and ligand-based drug design approach as a tool to define a novel 3D-pharmacophore model of human A3 adenosine receptor antagonists: pyrazolo[4,3-e]1,2,4-triazolo[1,5-c]pyrimidine derivatives as a key study. J Med Chem 48:152-62 (2005)  
Target
Name:
Adenosine receptor A3
Synonyms:
A3 adenosine receptor (hA3) ADORA3 | Adenosine A3 receptor (A3AR)
Type:
G Protein-Coupled Receptor (GPCR)
Mol. Mass.:
36197.32
Organism:
Homo sapiens (Human)
Description:
P0DMS8
Residue:
318
  
Inhibitor
Name:
BDBM50109462
Synonyms:
1-(4-Fluoro-phenyl)-3-(2-furan-2-yl-8-propyl-8H-pyrazolo[4,3-e][1,2,4]triazolo[1,5-c]pyrimidin-5-yl)-urea CHEMBL165778
Type:
Small organic molecule
Emp. Form.:
C20H17FN8O2
Mol. Mass.:
420.3998
SMILES:
CCCn1cc2c(n1)nc(NC(=O)Nc1ccc(F)cc1)n1nc(nc21)-c1ccco1
: