Target
Histamine H3 receptor
Ligand
BDBM50159116
Substrate
Meas. Tech.
ChEMBL_303027 (CHEMBL830414)
Ki
2.9±n/a nM
Citation
 Zaragoza, FStephensen, HPeschke, BRimvall, K 2-(4-alkylpiperazin-1-yl)quinolines as a new class of imidazole-free histamine H3 receptor antagonists. J Med Chem 48:306-11 (2005)  
Target
Name:
Histamine H3 receptor
Synonyms:
G-protein coupled receptor 97 HH3R HRH3 Histamine H3 receptor (H3) Histamine receptor (H3 and H4)
Type:
G Protein-Coupled Receptor (GPCR)
Mol. Mass.:
48691.47
Organism:
Homo sapiens (Human)
Description:
Binding assays were using CHO cells stably expressing hH3R receptors.
Residue:
445
  
Inhibitor
Name:
BDBM50159116
Synonyms:
2-[4-(1-Ethyl-propyl)-piperazin-1-yl]-quinoline | CHEMBL360156
Type:
Small organic molecule
Emp. Form.:
C18H25N3
Mol. Mass.:
283.4112
SMILES:
CCC(CC)N1CCN(CC1)c1ccc2ccccc2n1
: