Target
Histamine H3 receptor
Ligand
BDBM50159122
Substrate
Meas. Tech.
ChEMBL_303027 (CHEMBL830414)
Ki
3±n/a nM
Citation
 Zaragoza, FStephensen, HPeschke, BRimvall, K 2-(4-alkylpiperazin-1-yl)quinolines as a new class of imidazole-free histamine H3 receptor antagonists. J Med Chem 48:306-11 (2005)  
Target
Name:
Histamine H3 receptor
Synonyms:
G-protein coupled receptor 97 HH3R HRH3 Histamine H3 receptor (H3) Histamine receptor (H3 and H4)
Type:
G Protein-Coupled Receptor (GPCR)
Mol. Mass.:
48691.47
Organism:
Homo sapiens (Human)
Description:
Binding assays were using CHO cells stably expressing hH3R receptors.
Residue:
445
  
Inhibitor
Name:
BDBM50159122
Synonyms:
2-(4-Cyclopropyl-piperazin-1-yl)-6-methoxy-quinoline | CHEMBL179624
Type:
Small organic molecule
Emp. Form.:
C17H21N3O
Mol. Mass.:
283.3681
SMILES:
COc1ccc2nc(ccc2c1)N1CCN(CC1)C1CC1
: