Target
Mu-type opioid receptor
Ligand
BDBM50159685
Substrate
Meas. Tech.
ChEMBL_302850 (CHEMBL828766)
Ki
0.15±n/a nM
Citation
 Li, TFujita, YTsuda, YMiyazaki, AAmbo, ASasaki, YJinsmaa, YBryant, SDLazarus, LHOkada, Y Development of potent mu-opioid receptor ligands using unique tyrosine analogues of endomorphin-2. J Med Chem 48:586-92 (2005)  
Target
Name:
Mu-type opioid receptor
Synonyms:
MOR-1 Mu-type opioid receptor (MOR) OPRM_RAT Opioid receptor B Ror-b
Type:
G Protein-Coupled Receptor (GPCR)
Mol. Mass.:
44503.11
Organism:
Rattus norvegicus (rat)
Description:
Competition binding assays were carried out using membrane preparations from transfected HN9.10 cells that constitutively expressed the mu opioid receptor.
Residue:
398
  
Inhibitor
Name:
BDBM50159685
Synonyms:
5N-[1-[1-carbamoyl-2-phenyl-(1S)-ethylcarbamoyl]-2-phenyl-(1S)-ethyl]-1-[2-amino-3-(4-hydroxy-2,5-dimethylphenyl)-(2S)-propanoyl]-(5S)-dihydro-1H-5-pyrrolecarboxamide | CHEMBL367635
Type:
Small organic molecule
Emp. Form.:
C34H41N5O5
Mol. Mass.:
599.7198
SMILES:
Cc1cc(C[C@H](N)C(=O)N2CCCC2C(=O)N[C@@H](Cc2ccccc2)C(=O)N[C@@H](Cc2ccccc2)C(N)=O)c(C)cc1O
: