Target
Carbonic anhydrase 2
Ligand
BDBM92964
Substrate
Meas. Tech.
ChEMBL_302622 (CHEMBL838819)
Ki
990000±n/a nM
Citation
 Innocenti, AVullo, DScozzafava, ACasey, JRSupuran, C Carbonic anhydrase inhibitors. Interaction of isozymes I, II, IV, V, and IX with carboxylates. Bioorg Med Chem Lett 15:573-8 (2005)  
Target
Name:
Carbonic anhydrase 2
Synonyms:
CA-II CAC Carbonate dehydratase II Carbonic anhydrase 2 (CA-II) Carbonic anhydrase C Carbonic anhydrase II (CA-II) Carbonic anhydrase II (hCA II) | Carbonic anhydrase isoenzyme II (hCA II)
Type:
Enzyme
Mol. Mass.:
29250.71
Organism:
Homo sapiens (Human)
Description:
P00918
Residue:
260
  
Inhibitor
Name:
BDBM92964
Synonyms:
CHEMBL182928 | Oxalate
Type:
Small molecule
Emp. Form.:
C2O4
Mol. Mass.:
88.0201
SMILES:
[O-]C(=O)C([O-])=O
: