Target
Transient receptor potential cation channel subfamily V member 1
Ligand
BDBM50160041
Substrate
Meas. Tech.
ChEMBL_306510 (CHEMBL828115)
IC50
150±n/a nM
Citation
 Park, HGChoi, JYKim, MHChoi, SHPark, MKLee, JSuh, YGCho, HOh, UKim, HDJoo, YHShin, SSKim, JKJeong, YSKoh, HJPark, YHJew, SS Biarylcarboxybenzamide derivatives as potent vanilloid receptor (VR1) antagonistic ligands. Bioorg Med Chem Lett 15:631-4 (2005)  
Target
Name:
Transient receptor potential cation channel subfamily V member 1
Synonyms:
Capsaicin receptor TRPV1_RAT Trpv1 Vanilloid VR1 Vanilloid receptor 1 (VRI/TRPV1) Vanilloid receptor type 1-like (TrpV1/Vr1) Vr1l | osm-9-like TRP channel 1
Type:
Transient Receptor
Mol. Mass.:
94956.12
Organism:
Rattus norvegicus (rat)
Description:
O35433
Residue:
838
  
Inhibitor
Name:
BDBM50160041
Synonyms:
4-Pyridin-2-yl-piperazine-1-carboxylic acid (4-tert-butyl-phenyl)-amide | CHEMBL183623
Type:
Small organic molecule
Emp. Form.:
C20H26N4O
Mol. Mass.:
338.4466
SMILES:
CC(C)(C)c1ccc(NC(=O)N2CCN(CC2)c2ccccn2)cc1
: