Target
Alpha-1A adrenergic receptor
Ligand
BDBM50160162
Substrate
Meas. Tech.
ChEMBL_303343 (CHEMBL840159)
Ki
41±n/a nM
Citation
 Li, MYTsai, KCXia, L Pharmacophore identification of alpha(1A)-adrenoceptor antagonists. Bioorg Med Chem Lett 15:657-64 (2005)  
Target
Name:
Alpha-1A adrenergic receptor
Synonyms:
ADA1A_HUMAN ADRA1C Alpha 1A-adrenoceptor Alpha adrenergic receptor 1a Alpha-adrenergic receptor 1c adrenergic Alpha1 | adrenergic Alpha1C
Type:
Cell-surface receptors
Mol. Mass.:
51511.67
Organism:
Homo sapiens (Human)
Description:
P35348
Residue:
466
  
Inhibitor
Name:
BDBM50160162
Synonyms:
4-[2-Naphthalen-1-yl-5-oxo-oxazol-(4E)-ylidenemethyl]-N-phenyl-piperazine-1-carboxamidine RS-513815
Type:
Small organic molecule
Emp. Form.:
C25H23N5O2
Mol. Mass.:
425.4824
SMILES:
NC(=Nc1ccccc1)N1CCN(CC1)C=C1N=C(OC1=O)c1cccc2ccccc12
: