Target
Alpha-1A adrenergic receptor
Ligand
BDBM50160163
Substrate
Meas. Tech.
ChEMBL_303162 (CHEMBL829974)
Ki
490±n/a nM
Citation
 Li, MYTsai, KCXia, L Pharmacophore identification of alpha(1A)-adrenoceptor antagonists. Bioorg Med Chem Lett 15:657-64 (2005)  
Target
Name:
Alpha-1A adrenergic receptor
Synonyms:
ADA1A_HUMAN ADRA1C Alpha 1A-adrenoceptor Alpha adrenergic receptor 1a Alpha-adrenergic receptor 1c adrenergic Alpha1 | adrenergic Alpha1C
Type:
Cell-surface receptors
Mol. Mass.:
51511.67
Organism:
Homo sapiens (Human)
Description:
P35348
Residue:
466
  
Inhibitor
Name:
BDBM50160163
Synonyms:
A-315456 Ethanesulfonic acid {3-[cyclohexylidene-(1H-imidazol-4-yl)-methyl]-phenyl}-amide
Type:
Small organic molecule
Emp. Form.:
C18H23N3O2S
Mol. Mass.:
345.459
SMILES:
CCS(=O)(=O)Nc1cccc(c1)C(c1cnc[nH]1)=C1CCCCC1
: