Target
DNA polymerase III subunit alpha
Ligand
BDBM50160352
Substrate
Meas. Tech.
ChEMBL_302909 (CHEMBL830369)
Ki
180±n/a nM
Citation
 Wright, GEBrown, NCXu, WCLong, ZYZhi, CGambino, JJBarnes, MHButler, MM Active site directed inhibitors of replication-specific bacterial DNA polymerases. Bioorg Med Chem Lett 15:729-32 (2005)  
Target
Name:
DNA polymerase III subunit alpha
Synonyms:
DNA polymerase III DnaE DNA-directed DNA polymerase dnaE
Type:
Enzyme
Mol. Mass.:
125346.94
Organism:
Bacillus subtilis
Description:
Enzyme was purified from recombinant strains.
Residue:
1115
  
Inhibitor
Name:
BDBM50160352
Synonyms:
2-(3,4-Dichloro-benzylamino)-7-(5-methylsulfanyl-pentyl)-1,7-dihydro-purin-6-one | CHEMBL182057
Type:
Small organic molecule
Emp. Form.:
C18H21Cl2N5OS
Mol. Mass.:
426.363
SMILES:
CSCCCCCn1cnc2nc(NCc3ccc(Cl)c(Cl)c3)[nH]c(=O)c12
: