Target
Cannabinoid receptor 1
Ligand
BDBM50160427
Substrate
Meas. Tech.
ChEMBL_302577 (CHEMBL839538)
Ki
1968±n/a nM
Citation
 Lavey, BJKozlowski, JAHipkin, RWGonsiorek, WLundell, DJPiwinski, JJNarula, SLunn, CA Triaryl bis-sulfones as a new class of cannabinoid CB2 receptor inhibitors: identification of a lead and initial SAR studies. Bioorg Med Chem Lett 15:783-6 (2005)  
Target
Name:
Cannabinoid receptor 1
Synonyms:
CANN6 CB-R CNR CNR1_HUMAN Cannabinoid receptor Cannabinoid receptor 1 (brain)
Type:
G Protein-Coupled Receptor (GPCR)
Mol. Mass.:
52868.96
Organism:
Homo sapiens (Human)
Description:
P21554
Residue:
472
  
Inhibitor
Name:
BDBM50160427
Synonyms:
CHEMBL181288 | Ethanesulfonic acid ((S)-1-{4-[4-methoxy-2-(4-methoxy-benzenesulfonyl)-benzenesulfonyl]-phenyl}-ethyl)-amide
Type:
Small organic molecule
Emp. Form.:
C24H27NO8S3
Mol. Mass.:
553.668
SMILES:
CCS(=O)(=O)N[C@@H](C)c1ccc(cc1)S(=O)(=O)c1ccc(OC)cc1S(=O)(=O)c1ccc(OC)cc1
: