Target
5-hydroxytryptamine receptor 1A
Ligand
BDBM50160611
Substrate
Meas. Tech.
ChEMBL_303397 (CHEMBL840060)
Ki
1.08±n/a nM
Citation
 Evrard, DAZhou, PYi, SYZhou, DSmith, DLSullivan, KMHornby, GASchechter, LEAndree, THMewshaw, RE Studies towards the next generation of antidepressants. Part 4: derivatives of 4-(5-fluoro-1H-indol-3-yl)cyclohexylamine with affinity for the serotonin transporter and the 5-HT1A receptor. Bioorg Med Chem Lett 15:911-4 (2005)  
Target
Name:
5-hydroxytryptamine receptor 1A
Synonyms:
5-HT-1A 5-hydroxytryptamine receptor 1A (5-HT-1A) ADRB2RL1 Dopamine D2 receptor and serotonin 1a receptor HTR1A | Serotonin receptor 1A
Type:
Mol. Mass.:
46122.49
Organism:
Homo sapiens (Human)
Description:
Residue:
422
  
Inhibitor
Name:
BDBM50160611
Synonyms:
CHEMBL359549 | [4-(5-Fluoro-1H-indol-3-yl)-cyclohexyl]-[2-(1H-indol-4-yloxy)-ethyl]-amine
Type:
Small organic molecule
Emp. Form.:
C24H26FN3O
Mol. Mass.:
391.4811
SMILES:
Fc1ccc2[nH]cc([C@H]3CC[C@@H](CC3)NCCOc3cccc4[nH]ccc34)c2c1
: