Target
Estrogen receptor
Ligand
BDBM50161611
Substrate
Meas. Tech.
ChEMBL_310478 (CHEMBL834422)
EC50
173±n/a nM
Citation
 Hamann, LGMeyer, JHRuppar, DAMarschke, KBLopez, FJAllegretto, EAKaranewsky, DS Structure-activity relationships and sub-type selectivity in an oxabicyclic estrogen receptor alpha/beta agonist scaffold. Bioorg Med Chem Lett 15:1463-6 (2005)  
Target
Name:
Estrogen receptor
Synonyms:
ER ESR ESR1_HUMAN Estrogen receptor Estrogen receptor (ER-alpha) Estrogen receptor alpha (ER) Nuclear receptor subfamily 3 group A member 1
Type:
Protein
Mol. Mass.:
66230.44
Organism:
Homo sapiens (Human)
Description:
P03372
Residue:
595
  
Inhibitor
Name:
BDBM50161611
Synonyms:
4-((1R,2R,5R)-5-Hydroxymethyl-8-methyl-3-oxa-bicyclo[3.3.1]non-7-en-2-yl)-benzene-1,3-diol | CHEMBL178255
Type:
Small organic molecule
Emp. Form.:
C16H20O4
Mol. Mass.:
276.3276
SMILES:
CC1=CC[C@@]2(CO)CO[C@H]([C@@H]1C2)c1ccc(O)cc1O
: