Target
Estrogen receptor
Ligand
BDBM50161607
Substrate
Meas. Tech.
ChEMBL_310478 (CHEMBL834422)
EC50
1.1±n/a nM
Citation
 Hamann, LGMeyer, JHRuppar, DAMarschke, KBLopez, FJAllegretto, EAKaranewsky, DS Structure-activity relationships and sub-type selectivity in an oxabicyclic estrogen receptor alpha/beta agonist scaffold. Bioorg Med Chem Lett 15:1463-6 (2005)  
Target
Name:
Estrogen receptor
Synonyms:
ER ESR ESR1_HUMAN Estrogen receptor Estrogen receptor (ER-alpha) Estrogen receptor alpha (ER) Nuclear receptor subfamily 3 group A member 1
Type:
Protein
Mol. Mass.:
66230.44
Organism:
Homo sapiens (Human)
Description:
P03372
Residue:
595
  
Inhibitor
Name:
BDBM50161607
Synonyms:
(1S,4R,5R)-4-(2-Fluoro-4-hydroxy-phenyl)-2,2,6-trimethyl-3-oxa-bicyclo[3.3.1]non-6-en-1-ol | CHEMBL369337
Type:
Small organic molecule
Emp. Form.:
C17H21FO3
Mol. Mass.:
292.3452
SMILES:
CC1=CC[C@]2(O)C[C@H]1[C@@H](OC2(C)C)c1ccc(O)cc1F
: