Target
Estrogen receptor
Ligand
BDBM50161610
Substrate
Meas. Tech.
ChEMBL_310478 (CHEMBL834422)
EC50
336±n/a nM
Citation
 Hamann, LGMeyer, JHRuppar, DAMarschke, KBLopez, FJAllegretto, EAKaranewsky, DS Structure-activity relationships and sub-type selectivity in an oxabicyclic estrogen receptor alpha/beta agonist scaffold. Bioorg Med Chem Lett 15:1463-6 (2005)  
Target
Name:
Estrogen receptor
Synonyms:
ER ESR ESR1_HUMAN Estrogen receptor Estrogen receptor (ER-alpha) Estrogen receptor alpha (ER) Nuclear receptor subfamily 3 group A member 1
Type:
Protein
Mol. Mass.:
66230.44
Organism:
Homo sapiens (Human)
Description:
P03372
Residue:
595
  
Inhibitor
Name:
BDBM50161610
Synonyms:
2-Bromo-4-((1R,2R,5R)-5-hydroxymethyl-8-methyl-3-oxa-bicyclo[3.3.1]non-7-en-2-yl)-phenol | CHEMBL178404
Type:
Small organic molecule
Emp. Form.:
C16H19BrO3
Mol. Mass.:
339.224
SMILES:
CC1=CC[C@@]2(CO)CO[C@H]([C@@H]1C2)c1ccc(O)c(Br)c1
: