Target
Estrogen receptor beta
Ligand
BDBM50161607
Substrate
Meas. Tech.
ChEMBL_310473 (CHEMBL834417)
EC50
1.4±n/a nM
Citation
 Hamann, LGMeyer, JHRuppar, DAMarschke, KBLopez, FJAllegretto, EAKaranewsky, DS Structure-activity relationships and sub-type selectivity in an oxabicyclic estrogen receptor alpha/beta agonist scaffold. Bioorg Med Chem Lett 15:1463-6 (2005)  
Target
Name:
Estrogen receptor beta
Synonyms:
ER-beta ESR2_HUMAN Estradiol receptor beta (ERβ) Estrogen receptor (ER beta) Estrogen receptor beta (ER beta) NR3A2 estrogen beta
Type:
Protein
Mol. Mass.:
59238.43
Organism:
Homo sapiens (Human)
Description:
Q92731
Residue:
530
  
Inhibitor
Name:
BDBM50161607
Synonyms:
(1S,4R,5R)-4-(2-Fluoro-4-hydroxy-phenyl)-2,2,6-trimethyl-3-oxa-bicyclo[3.3.1]non-6-en-1-ol | CHEMBL369337
Type:
Small organic molecule
Emp. Form.:
C17H21FO3
Mol. Mass.:
292.3452
SMILES:
CC1=CC[C@]2(O)C[C@H]1[C@@H](OC2(C)C)c1ccc(O)cc1F
: