Target
Estrogen receptor
Ligand
BDBM50161612
Substrate
Meas. Tech.
ChEMBL_310478 (CHEMBL834422)
EC50
141±n/a nM
Citation
 Hamann, LGMeyer, JHRuppar, DAMarschke, KBLopez, FJAllegretto, EAKaranewsky, DS Structure-activity relationships and sub-type selectivity in an oxabicyclic estrogen receptor alpha/beta agonist scaffold. Bioorg Med Chem Lett 15:1463-6 (2005)  
Target
Name:
Estrogen receptor
Synonyms:
ER ESR ESR1_HUMAN Estrogen receptor Estrogen receptor (ER-alpha) Estrogen receptor alpha (ER) Nuclear receptor subfamily 3 group A member 1
Type:
Protein
Mol. Mass.:
66230.44
Organism:
Homo sapiens (Human)
Description:
P03372
Residue:
595
  
Inhibitor
Name:
BDBM50161612
Synonyms:
(1R,4R,5R)-4-(4-Hydroxy-phenyl)-6,8,8-trimethyl-3-oxa-bicyclo[3.3.1]non-6-en-1-ol | CHEMBL179708
Type:
Small organic molecule
Emp. Form.:
C17H22O3
Mol. Mass.:
274.3548
SMILES:
CC1=CC(C)(C)[C@@]2(O)CO[C@H]([C@@H]1C2)c1ccc(O)cc1
: