Target
Thymidylate synthase
Ligand
BDBM50161776
Substrate
Meas. Tech.
ChEMBL_302848 (CHEMBL827892)
Ki
0.1±n/a nM
Citation
 Tondi, DVenturelli, AFerrari, SGhelli, SCosti, MP Improving specificity vs bacterial thymidylate synthases through N-dansyl modulation of didansyltyrosine. J Med Chem 48:913-6 (2005)  
Target
Name:
Thymidylate synthase
Synonyms:
TSase Thymidylate Synthase (TS) thyA
Type:
Enzyme
Mol. Mass.:
36576.54
Organism:
Lactobacillus casei
Description:
Residue:
316
  
Inhibitor
Name:
BDBM50161776
Synonyms:
(S)-2-(5-Benzyloxycarbonylamino-naphthalene-1-sulfonylamino)-3-[4-(5-dimethylamino-naphthalene-1-sulfonyloxy)-phenyl]-propionic acid | CHEMBL360758
Type:
Small organic molecule
Emp. Form.:
C39H35N3O9S2
Mol. Mass.:
753.84
SMILES:
CN(C)c1cccc2c(cccc12)S(=O)(=O)Oc1ccc(C[C@H](NS(=O)(=O)c2cccc3c(NC(=O)OCc4ccccc4)cccc23)C(O)=O)cc1
: