Target
Thymidylate synthase
Ligand
BDBM50161777
Substrate
Meas. Tech.
ChEMBL_302477 (CHEMBL875209)
Ki
4.1±n/a nM
Citation
 Tondi, DVenturelli, AFerrari, SGhelli, SCosti, MP Improving specificity vs bacterial thymidylate synthases through N-dansyl modulation of didansyltyrosine. J Med Chem 48:913-6 (2005)  
Target
Name:
Thymidylate synthase
Synonyms:
TS TYMS Thymidylate synthase (TS) | Thymidylate synthase/GAR transformylase/AICAR transformylase
Type:
Enzyme
Mol. Mass.:
35718.07
Organism:
Homo sapiens (Human)
Description:
Residue:
313
  
Inhibitor
Name:
BDBM50161777
Synonyms:
(S)-3-[4-(5-Dimethylamino-naphthalene-1-sulfonyloxy)-phenyl]-2-(6-nitro-naphthalene-1-sulfonylamino)-propionic acid | CHEMBL362606
Type:
Small organic molecule
Emp. Form.:
C31H27N3O9S2
Mol. Mass.:
649.691
SMILES:
CN(C)c1cccc2c(cccc12)S(=O)(=O)Oc1ccc(C[C@H](NS(=O)(=O)c2cccc3cc(ccc23)[N+]([O-])=O)C(O)=O)cc1
: