Target
Mitogen-activated protein kinase 3
Ligand
BDBM50162147
Substrate
Meas. Tech.
ChEMBL_305358 (CHEMBL832738)
IC50
>10000±n/a nM
Citation
 Kubo, KShimizu, TOhyama, SMurooka, HIwai, ANakamura, KHasegawa, KKobayashi, YTakahashi, NTakahashi, KKato, SIzawa, TIsoe, T Novel potent orally active selective VEGFR-2 tyrosine kinase inhibitors: synthesis, structure-activity relationships, and antitumor activities of N-phenyl-N'-{4-(4-quinolyloxy)phenyl}ureas. J Med Chem 48:1359-66 (2005)  
Target
Name:
Mitogen-activated protein kinase 3
Synonyms:
ERK1 Extracellular signal-regulated kinase 1 MAP kinase ERK1 MAPK3/MAPK7 Mitogen-activated protein kinase PRKM3
Type:
Protein
Mol. Mass.:
43136.58
Organism:
Homo sapiens (Human)
Description:
curated by PDB 4QTB
Residue:
379
  
Inhibitor
Name:
BDBM50162147
Synonyms:
1-(2,4-Difluoro-phenyl)-3-[4-(6,7-dimethoxy-quinolin-4-yloxy)-2-fluoro-phenyl]-urea | CHEMBL178455
Type:
Small organic molecule
Emp. Form.:
C24H18F3N3O4
Mol. Mass.:
469.4126
SMILES:
COc1cc2nccc(Oc3ccc(NC(=O)Nc4ccc(F)cc4F)c(F)c3)c2cc1OC
: