Target
Bifunctional dihydrofolate reductase-thymidylate synthase
Ligand
BDBM50078468
Substrate
Meas. Tech.
ChEMBL_305629 (CHEMBL828662)
IC50
11±n/a nM
Citation
 Gangjee, ALin, X CoMFA and CoMSIA analyses of Pneumocystis carinii dihydrofolate reductase, Toxoplasma gondii dihydrofolate reductase, and rat liver dihydrofolate reductase. J Med Chem 48:1448-69 (2005)  
Target
Name:
Bifunctional dihydrofolate reductase-thymidylate synthase
Synonyms:
DHFR-TS Dihydrofolate reductase Dihydrofolate reductase; T. gondii vs rat
Type:
Enzyme
Mol. Mass.:
68757.49
Organism:
Toxoplasma gondii
Description:
Q07422
Residue:
610
  
Inhibitor
Name:
BDBM50078468
Synonyms:
6-[(3-Chloro-phenylamino)-methyl]-5-methyl-pyrido[2,3-d]pyrimidine-2,4-diamine | CHEMBL80066
Type:
Small organic molecule
Emp. Form.:
C15H15ClN6
Mol. Mass.:
314.773
SMILES:
Cc1c(CNc2cccc(Cl)c2)cnc2nc(N)nc(N)c12
: