Target
Dihydrofolate reductase
Ligand
BDBM50034942
Substrate
Meas. Tech.
ChEMBL_305461 (CHEMBL830957)
IC50
10.5±n/a nM
Citation
 Gangjee, ALin, X CoMFA and CoMSIA analyses of Pneumocystis carinii dihydrofolate reductase, Toxoplasma gondii dihydrofolate reductase, and rat liver dihydrofolate reductase. J Med Chem 48:1448-69 (2005)  
Target
Name:
Dihydrofolate reductase
Synonyms:
DYR_RAT Dihydrofolate reductase (DHFR) Tetrahydrofolate dehydrogenase
Type:
Enzyme
Mol. Mass.:
21638.84
Organism:
Rattus norvegicus (rat)
Description:
Residue:
187
  
Inhibitor
Name:
BDBM50034942
Synonyms:
6-{[Ethyl-(3,4,5-trimethoxy-phenyl)-amino]-methyl}-5-methyl-pyrido[2,3-d]pyrimidine-2,4-diamine | CHEMBL52433
Type:
Small organic molecule
Emp. Form.:
C20H26N6O3
Mol. Mass.:
398.4588
SMILES:
CCN(Cc1cnc2nc(N)nc(N)c2c1C)c1cc(OC)c(OC)c(OC)c1
: