Target
Bifunctional dihydrofolate reductase-thymidylate synthase
Ligand
BDBM50033555
Substrate
Meas. Tech.
ChEMBL_305629 (CHEMBL828662)
IC50
12±n/a nM
Citation
 Gangjee, ALin, X CoMFA and CoMSIA analyses of Pneumocystis carinii dihydrofolate reductase, Toxoplasma gondii dihydrofolate reductase, and rat liver dihydrofolate reductase. J Med Chem 48:1448-69 (2005)  
Target
Name:
Bifunctional dihydrofolate reductase-thymidylate synthase
Synonyms:
DHFR-TS Dihydrofolate reductase Dihydrofolate reductase; T. gondii vs rat
Type:
Enzyme
Mol. Mass.:
68757.49
Organism:
Toxoplasma gondii
Description:
Q07422
Residue:
610
  
Inhibitor
Name:
BDBM50033555
Synonyms:
6-{[Prop-2-ynyl-(3,4,5-trimethoxy-phenyl)-amino]-methyl}-5,6,7,8-tetrahydro-quinazoline-2,4-diamine | CHEMBL120821
Type:
Small organic molecule
Emp. Form.:
C21H27N5O3
Mol. Mass.:
397.4708
SMILES:
COc1cc(cc(OC)c1OC)N(CC#C)CC1CCc2nc(N)nc(N)c2C1
: