Target
Vascular endothelial growth factor receptor 2
Ligand
BDBM50162972
Substrate
Meas. Tech.
ChEMBL_306228 (CHEMBL831136)
IC50
18±n/a nM
Citation
 Baindur, NChadha, NBrandt, BMAsgari, DPatch, RJSchalk-Hihi, CCarver, TEPetrounia, IPBaumann, CAOtt, HManthey, CSpringer, BAPlayer, MR 2-Hydroxy-4,6-diamino-[1,3,5]triazines: a novel class of VEGF-R2 (KDR) tyrosine kinase inhibitors. J Med Chem 48:1717-20 (2005)  
Target
Name:
Vascular endothelial growth factor receptor 2
Synonyms:
CD_antigen=CD309 Fetal liver kinase 1 (FLK-1) KDR Protein-tyrosine kinase receptor Flk-1 VEGFR-2 VEGFR2 Vascular Endothelial Growth Factor Receptor Kinase 2 Vascular endothelial growth factor receptor 2 (KDR) Vascular endothelial growth factor receptor 2 (VEGFR2) Vascular endothelial growth factor receptor-2 (VEGFR-2)
Type:
Receptor Tyrosine Kinase
Mol. Mass.:
151510.97
Organism:
Homo sapiens (Human)
Description:
P35968
Residue:
1356
  
Inhibitor
Name:
BDBM50162972
Synonyms:
4-(Benzothiazol-6-ylamino)-6-(benzyl-isopropyl-amino)-[1,3,5]triazin-2-ol | CHEMBL176019
Type:
Small organic molecule
Emp. Form.:
C20H20N6OS
Mol. Mass.:
392.477
SMILES:
CC(C)N(Cc1ccccc1)c1nc(Nc2ccc3ncsc3c2)[nH]c(=O)n1
: