Target
Adenosine receptor A3
Ligand
BDBM50163031
Substrate
Meas. Tech.
ChEMBL_303186 (CHEMBL829680)
Ki
0.69±n/a nM
Citation
 Tchilibon, SJoshi, BVKim, SKDuong, HTGao, ZGJacobson, KA (N)-methanocarba 2,N6-disubstituted adenine nucleosides as highly potent and selective A3 adenosine receptor agonists. J Med Chem 48:1745-58 (2005)  
Target
Name:
Adenosine receptor A3
Synonyms:
A3 adenosine receptor (hA3) ADORA3 | Adenosine A3 receptor (A3AR)
Type:
G Protein-Coupled Receptor (GPCR)
Mol. Mass.:
36197.32
Organism:
Homo sapiens (Human)
Description:
P0DMS8
Residue:
318
  
Inhibitor
Name:
BDBM50163031
Synonyms:
(1S,2R,3S,4R,5S)-4-(2-chloro-6-(2,2-diphenylethylamino)-9H-purin-9-yl)-2,3-dihydroxy-N-methylbicyclo[3.1.0]hexane-1-carboxamide CHEMBL368872
Type:
Small organic molecule
Emp. Form.:
C27H27ClN6O3
Mol. Mass.:
518.995
SMILES:
CNC(=O)[C@]12C[C@@H]1[C@H]([C@H](O)[C@@H]2O)n1cnc2c(NCC(c3ccccc3)c3ccccc3)nc(Cl)nc12
: