Target
Alpha-2C adrenergic receptor
Ligand
BDBM50024314
Substrate
Meas. Tech.
ChEMBL_302773 (CHEMBL852482)
Ki
1.6±n/a nM
Citation
 Andrés, JIAlcázar, JAlonso, JMAlvarez, RMBakker, MHBiesmans, ICid, JMDe Lucas, AIFernández, JFont, LMHens, KAIturrino, LLenaerts, IMartínez, SMegens, AAPastor, JVermote, PCSteckler, T Discovery of a new series of centrally active tricyclic isoxazoles combining serotonin (5-HT) reuptake inhibition with alpha2-adrenoceptor blocking activity. J Med Chem 48:2054-71 (2005)  
Target
Name:
Alpha-2C adrenergic receptor
Synonyms:
ADA2C_HUMAN ADRA2L2 Adrenergic alpha2C Adrenergic receptor alpha Alpha-2 adrenergic receptor subtype C4 Alpha-2C adrenoreceptor | adrenergic, alpha-2C-, receptor [Homo sapiens]
Type:
Enzyme
Mol. Mass.:
49552.32
Organism:
Homo sapiens (Human)
Description:
P18825
Residue:
462
  
Inhibitor
Name:
BDBM50024314
Synonyms:
CHEMBL2112969
Type:
Small organic molecule
Emp. Form.:
C25H31FN4O4
Mol. Mass.:
470.5364
SMILES:
[H][C@@]12CNc3cc(OC)c(OC)cc3C1=NO[C@H]2CN1CCN(CCOc2ccc(F)cc2)CC1
: