Target
Alpha-2A adrenergic receptor
Ligand
BDBM50131346
Substrate
Meas. Tech.
ChEMBL_308674 (CHEMBL833650)
Ki
0.800000±n/a nM
Citation
 Andrés, JIAlcázar, JAlonso, JMAlvarez, RMBakker, MHBiesmans, ICid, JMDe Lucas, AIFernández, JFont, LMHens, KAIturrino, LLenaerts, IMartínez, SMegens, AAPastor, JVermote, PCSteckler, T Discovery of a new series of centrally active tricyclic isoxazoles combining serotonin (5-HT) reuptake inhibition with alpha2-adrenoceptor blocking activity. J Med Chem 48:2054-71 (2005)  
Target
Name:
Alpha-2A adrenergic receptor
Synonyms:
ADA2A_HUMAN ADRA2R Adrenergic alpha2A Alpha-2 adrenergic receptor subtype C10 Alpha-2A adrenoreceptor alpha-2A adrenergic receptor [Homo sapiens]
Type:
Enzyme
Mol. Mass.:
48979.91
Organism:
Homo sapiens (Human)
Description:
P08913
Residue:
450
  
Inhibitor
Name:
BDBM50131346
Synonyms:
(3R,3aS)-7,8-Dimethoxy-3-[4-((E)-2-methyl-3-phenyl-allyl)-piperazin-1-ylmethyl]-3a,4-dihydro-3H-chromeno[4,3-c]isoxazole CHEMBL91157
Type:
Small organic molecule
Emp. Form.:
C27H33N3O4
Mol. Mass.:
463.5686
SMILES:
COc1cc2OC[C@H]3[C@H](CN4CCN(C\C(C)=C\c5ccccc5)CC4)ON=C3c2cc1OC
: