Target
Alpha-2C adrenergic receptor
Ligand
BDBM50057128
Substrate
Meas. Tech.
ChEMBL_303466 (CHEMBL838762)
Ki
2.1±n/a nM
Citation
 Andrés, JIAlcázar, JAlonso, JMAlvarez, RMBakker, MHBiesmans, ICid, JMDe Lucas, AIFernández, JFont, LMHens, KAIturrino, LLenaerts, IMartínez, SMegens, AAPastor, JVermote, PCSteckler, T Discovery of a new series of centrally active tricyclic isoxazoles combining serotonin (5-HT) reuptake inhibition with alpha2-adrenoceptor blocking activity. J Med Chem 48:2054-71 (2005)  
Target
Name:
Alpha-2C adrenergic receptor
Synonyms:
ADA2C_HUMAN ADRA2L2 Adrenergic alpha2C Adrenergic receptor alpha Alpha-2 adrenergic receptor subtype C4 Alpha-2C adrenoreceptor | adrenergic, alpha-2C-, receptor [Homo sapiens]
Type:
Enzyme
Mol. Mass.:
49552.32
Organism:
Homo sapiens (Human)
Description:
P18825
Residue:
462
  
Inhibitor
Name:
BDBM50057128
Synonyms:
(2-Benzofuran-6-yl-ethyl)-((R)-5-methoxy-1,2,3,4-tetrahydro-naphthalen-1-ylmethyl)-methyl-amine CHEMBL268258
Type:
Small organic molecule
Emp. Form.:
C23H27NO2
Mol. Mass.:
349.466
SMILES:
COc1cccc2[C@H](CN(C)CCc3ccc4ccoc4c3)CCCc12
: