Target
Sodium channel protein type 9 subunit alpha
Ligand
BDBM50164039
Substrate
Meas. Tech.
ChEMBL_308686 (CHEMBL834126)
Ki
30±n/a nM
Citation
 Shao, PPOk, DFisher, MHGarcia, MLKaczorowski, GJLi, CLyons, KAMartin, WJMeinke, PTPriest, BTSmith, MMWyvratt, MJYe, FParsons, WH Novel cyclopentane dicarboxamide sodium channel blockers as a potential treatment for chronic pain. Bioorg Med Chem Lett 15:1901-7 (2005)  
Target
Name:
Sodium channel protein type 9 subunit alpha
Synonyms:
NENA Peripheral sodium channel 1 SCN9A_HUMAN Voltage-gated sodium channel subunit Nav1.7 hNE-Na
Type:
Protein
Mol. Mass.:
226375.97
Organism:
Homo sapiens (Human)
Description:
Q15858
Residue:
1988
  
Inhibitor
Name:
BDBM50164039
Synonyms:
(1S,2S)-Cyclopentane-1,2-dicarboxylic acid 1-[(biphenyl-4-ylmethyl)-amide] 2-[(2''-sulfamoyl-biphenyl-4-ylmethyl)-amide] | CHEMBL426790
Type:
Small organic molecule
Emp. Form.:
C33H33N3O4S
Mol. Mass.:
567.698
SMILES:
NS(=O)(=O)c1ccccc1-c1ccc(CNC(=O)[C@H]2CCC[C@@H]2C(=O)NCc2ccc(cc2)-c2ccccc2)cc1
: