Target
Muscarinic acetylcholine receptor M3
Ligand
BDBM50165017
Substrate
Meas. Tech.
ChEMBL_302296 (CHEMBL827057)
Ki
6.00±n/a nM
Citation
 Kaur, KAeron, SBruhaspathy, MShetty, SJGupta, SHegde, LHSilamkoti, ADMehta, AChugh, AGupta, JBSarma, PKKumar, N Design, synthesis and activity of novel derivatives of oxybutynin and tolterodine. Bioorg Med Chem Lett 15:2093-6 (2005)  
Target
Name:
Muscarinic acetylcholine receptor M3
Synonyms:
ACM3_RAT Chrm-3 | Chrm3
Type:
Enzyme Catalytic Domain
Mol. Mass.:
66086.66
Organism:
RAT
Description:
Cholinergic, muscarinic M3 CHRM3 RAT::P08483
Residue:
589
  
Inhibitor
Name:
BDBM50165017
Synonyms:
CHEMBL192485 | Cyclopentyl-hydroxy-phenyl-acetic acid 4-(3-aza-bicyclo[3.1.0]hex-3-yl)-but-2-ynyl ester
Type:
Small organic molecule
Emp. Form.:
C22H27NO3
Mol. Mass.:
353.4547
SMILES:
OC(C1CCCC1)(C(=O)OCC#CCN1CC2CC2C1)c1ccccc1
: