Target
Muscarinic acetylcholine receptor M2
Ligand
BDBM50165010
Substrate
Meas. Tech.
ChEMBL_302412 (CHEMBL875203)
Ki
72±n/a nM
Citation
 Kaur, KAeron, SBruhaspathy, MShetty, SJGupta, SHegde, LHSilamkoti, ADMehta, AChugh, AGupta, JBSarma, PKKumar, N Design, synthesis and activity of novel derivatives of oxybutynin and tolterodine. Bioorg Med Chem Lett 15:2093-6 (2005)  
Target
Name:
Muscarinic acetylcholine receptor M2
Synonyms:
ACM2_RAT Chrm-2 | Chrm2
Type:
Enzyme Catalytic Domain
Mol. Mass.:
51555.53
Organism:
RAT
Description:
P10980
Residue:
466
  
Inhibitor
Name:
BDBM50165010
Synonyms:
CHEMBL192537 | Cyclohexyl-hydroxy-phenyl-acetic acid 4-(3-aza-bicyclo[3.1.0]hex-3-yl)-but-2-ynyl ester
Type:
Small organic molecule
Emp. Form.:
C23H29NO3
Mol. Mass.:
367.4813
SMILES:
OC(C1CCCCC1)(C(=O)OCC#CCN1CC2CC2C1)c1ccccc1
: