Target
Melanin-concentrating hormone receptor 1
Ligand
BDBM50168513
Substrate
Meas. Tech.
ChEMBL_306753 (CHEMBL830898)
IC50
1560±n/a nM
Citation
 Vasudevan, AVerzal, MKWodka, DSouers, AJBlackburn, CChe, JLLai, SBrodjian, SFalls, DHDayton, BDGovek, EDaniels, TGeddes, BMarsh, KCHernandez, LECollins, CAKym, PR Identification of aminopiperidine benzamides as MCHr1 antagonists. Bioorg Med Chem Lett 15:3412-6 (2005)  
Target
Name:
Melanin-concentrating hormone receptor 1
Synonyms:
Gpr24 Mchr1 | Slc1
Type:
PROTEIN
Mol. Mass.:
39133.74
Organism:
Mus musculus
Description:
ChEMBL_818502
Residue:
353
  
Inhibitor
Name:
BDBM50168513
Synonyms:
CHEMBL434156 | N-(1-Benzo[1,3]dioxol-5-ylmethyl-piperidin-3-yl)-2,5-dimethoxy-benzamide
Type:
Small organic molecule
Emp. Form.:
C22H26N2O5
Mol. Mass.:
398.4522
SMILES:
COc1ccc(OC)c(c1)C(=O)NC1CCCN(Cc2ccc3OCOc3c2)C1
: