Target
Glutamate receptor ionotropic, kainate 2
Ligand
BDBM50168966
Substrate
Meas. Tech.
ChEMBL_303287 (CHEMBL828280)
Ki
>100000±n/a nM
Citation
 Dominguez, EIyengar, SShannon, HEBleakman, DAlt, AArnold, BMBell, MGBleisch, TJBuckmaster, JLCastano, AMDel Prado, MEscribano, AFilla, SAHo, KHHudziak, KJJones, CKMartinez-Perez, JAMateo, AMathes, BMMattiuz, ELOgden, AMSimmons, RMStack, DRStratford, REWinter, MAWu, ZOrnstein, PL Two prodrugs of potent and selective GluR5 kainate receptor antagonists actives in three animal models of pain. J Med Chem 48:4200-3 (2005)  
Target
Name:
Glutamate receptor ionotropic, kainate 2
Synonyms:
EAA4 GLUR6 GRIK2_HUMAN GluR-6 Glutamate receptor 6 Glutamate receptor, ionotropic kainate 2 Glutamate-Kainate, GluR6
Type:
Enzyme Catalytic Domain
Mol. Mass.:
102592.78
Organism:
Homo sapiens (Human)
Description:
Q13002
Residue:
908
  
Inhibitor
Name:
BDBM50168966
Synonyms:
(3S,4aR,6S,8aR)-6-[2-(1H-Tetrazol-5-yl)-phenylamino]-decahydro-isoquinoline-3-carboxylic acid 2-ethyl-butyl ester | CHEMBL187941
Type:
Small organic molecule
Emp. Form.:
C23H34N6O2
Mol. Mass.:
426.5551
SMILES:
CCC(CC)COC(=O)[C@@H]1C[C@H]2C[C@H](CC[C@H]2CN1)Nc1ccccc1-c1nnn[nH]1
: