Target
Glutamate receptor ionotropic, kainate 1
Ligand
BDBM50168965
Substrate
Meas. Tech.
ChEMBL_303286 (CHEMBL828279)
Ki
1690±n/a nM
Citation
 Dominguez, EIyengar, SShannon, HEBleakman, DAlt, AArnold, BMBell, MGBleisch, TJBuckmaster, JLCastano, AMDel Prado, MEscribano, AFilla, SAHo, KHHudziak, KJJones, CKMartinez-Perez, JAMateo, AMathes, BMMattiuz, ELOgden, AMSimmons, RMStack, DRStratford, REWinter, MAWu, ZOrnstein, PL Two prodrugs of potent and selective GluR5 kainate receptor antagonists actives in three animal models of pain. J Med Chem 48:4200-3 (2005)  
Target
Name:
Glutamate receptor ionotropic, kainate 1
Synonyms:
GLUR5 GRIK1_HUMAN Glutamate kainate Glutamate receptor ionotropic kainate 1 Glutamate-Kainate Grik1 protein | hmglur5 flipr
Type:
Enzyme Catalytic Domain
Mol. Mass.:
103984.96
Organism:
Homo sapiens (Human)
Description:
P39086
Residue:
918
  
Inhibitor
Name:
BDBM50168965
Synonyms:
(3S,4aS,6S,8aR)-6-[2-(1H-Tetrazol-5-yl)-phenoxy]-decahydro-isoquinoline-3-carboxylic acid | CHEMBL189985
Type:
Small organic molecule
Emp. Form.:
C17H21N5O3
Mol. Mass.:
343.3803
SMILES:
OC(=O)[C@@H]1C[C@H]2C[C@H](CC[C@H]2CN1)Oc1ccccc1-c1nnn[nH]1
: