Target
Cannabinoid receptor 1
Ligand
BDBM50170343
Substrate
Meas. Tech.
ChEMBL_302852 (CHEMBL828768)
Ki
23±n/a nM
Citation
 Huffman, JWSzklennik, PVAlmond, ABushell, KSelley, DEHe, HCassidy, MPWiley, JLMartin, BR 1-Pentyl-3-phenylacetylindoles, a new class of cannabimimetic indoles. Bioorg Med Chem Lett 15:4110-3 (2005)  
Target
Name:
Cannabinoid receptor 1
Synonyms:
Brain-type cannabinoid receptor CB-R CNR1_RAT Cannabinoid receptor Cnr1 | Skr6
Type:
G Protein-Coupled Receptor (GPCR)
Mol. Mass.:
52856.55
Organism:
Rattus norvegicus (rat)
Description:
P20272
Residue:
473
  
Inhibitor
Name:
BDBM50170343
Synonyms:
1-(2-Methyl-1-pentyl-1H-indol-3-yl)-2-o-tolyl-ethanone CHEMBL188494 | JWH-252
Type:
Small organic molecule
Emp. Form.:
C23H27NO
Mol. Mass.:
333.4666
SMILES:
CCCCCn1c(C)c(C(=O)Cc2ccccc2C)c2ccccc12
: