Target
Cannabinoid receptor 2
Ligand
BDBM50170346
Substrate
Meas. Tech.
ChEMBL_302853 (CHEMBL828769)
Ki
781±n/a nM
Citation
 Huffman, JWSzklennik, PVAlmond, ABushell, KSelley, DEHe, HCassidy, MPWiley, JLMartin, BR 1-Pentyl-3-phenylacetylindoles, a new class of cannabimimetic indoles. Bioorg Med Chem Lett 15:4110-3 (2005)  
Target
Name:
Cannabinoid receptor 2
Synonyms:
CANNABINOID CB2 CB2 CB2B CNR2_HUMAN Cannabinoid CB2 receptor Cannabinoid receptor 2 (CB2R) | hCB2
Type:
G Protein-Coupled Receptor (GPCR)
Mol. Mass.:
39690.94
Organism:
Homo sapiens (Human)
Description:
P34972
Residue:
360
  
Inhibitor
Name:
BDBM50170346
Synonyms:
2-(4-Fluoro-phenyl)-1-(2-methyl-1-pentyl-1H-indol-3-yl)-ethanone | CHEMBL190127
Type:
Small organic molecule
Emp. Form.:
C22H24FNO
Mol. Mass.:
337.4305
SMILES:
CCCCCn1c(C)c(C(=O)Cc2ccc(F)cc2)c2ccccc12
: