Target
Cannabinoid receptor 1
Ligand
BDBM50170336
Substrate
Meas. Tech.
ChEMBL_302852 (CHEMBL828768)
Ki
430±n/a nM
Citation
 Huffman, JWSzklennik, PVAlmond, ABushell, KSelley, DEHe, HCassidy, MPWiley, JLMartin, BR 1-Pentyl-3-phenylacetylindoles, a new class of cannabimimetic indoles. Bioorg Med Chem Lett 15:4110-3 (2005)  
Target
Name:
Cannabinoid receptor 1
Synonyms:
Brain-type cannabinoid receptor CB-R CNR1_RAT Cannabinoid receptor Cnr1 | Skr6
Type:
G Protein-Coupled Receptor (GPCR)
Mol. Mass.:
52856.55
Organism:
Rattus norvegicus (rat)
Description:
P20272
Residue:
473
  
Inhibitor
Name:
BDBM50170336
Synonyms:
2-(3-Fluoro-phenyl)-1-(2-methyl-1-pentyl-1H-indol-3-yl)-ethanone CHEMBL427524 | JWH-315
Type:
Small organic molecule
Emp. Form.:
C22H24FNO
Mol. Mass.:
337.4305
SMILES:
CCCCCn1c(C)c(C(=O)Cc2cccc(F)c2)c2ccccc12
: