Target
Methionine aminopeptidase 1
Ligand
BDBM50170371
Substrate
Meas. Tech.
ChEMBL_304990 (CHEMBL828603)
IC50
75.0±n/a nM
Citation
 Cui, YMHuang, QQXu, JChen, LLLi, JYYe, QZLi, JNan, FJ Identification of potent type I MetAPs inhibitors by simple bioisosteric replacement. Part 2: SAR studies of 5-heteroalkyl substituted TCAT derivatives. Bioorg Med Chem Lett 15:4130-5 (2005)  
Target
Name:
Methionine aminopeptidase 1
Synonyms:
MAP 1 MAP1_YEAST Peptidase M 1
Type:
PROTEIN
Mol. Mass.:
43382.92
Organism:
Saccharomyces cerevisiae
Description:
ChEMBL_10701
Residue:
387
  
Inhibitor
Name:
BDBM50170371
Synonyms:
5-Piperidin-1-ylmethyl-thiazole-4-carboxylic acid thiazol-2-ylamide | CHEMBL188263
Type:
Small organic molecule
Emp. Form.:
C13H16N4OS2
Mol. Mass.:
308.422
SMILES:
O=C(Nc1nccs1)c1ncsc1CN1CCCCC1
: