Target
Lysophosphatidic acid receptor 3
Ligand
BDBM50170850
Substrate
Meas. Tech.
ChEMBL_312537 (CHEMBL832580)
IC50
384±n/a nM
Citation
 Durgam, GGVirag, TWalker, MDTsukahara, RYasuda, SLiliom, Kvan Meeteren, LAMoolenaar, WHWilke, NSiess, WTigyi, GMiller, DD Synthesis, structure-activity relationships, and biological evaluation of fatty alcohol phosphates as lysophosphatidic acid receptor ligands, activators of PPARgamma, and inhibitors of autotaxin. J Med Chem 48:4919-30 (2005)  
Target
Name:
Lysophosphatidic acid receptor 3
Synonyms:
EDG7 LPAR3 Lysophosphatidic acid receptor 1/3 Lysophosphatidic acid receptor Edg-7
Type:
Enzyme
Mol. Mass.:
40149.72
Organism:
Homo sapiens (Human)
Description:
Q9UBY5
Residue:
353
  
Inhibitor
Name:
BDBM50170850
Synonyms:
CHEMBL361255 | Phosphoric acid monodecyl ester
Type:
Small organic molecule
Emp. Form.:
C10H23O4P
Mol. Mass.:
238.261
SMILES:
CCCCCCCCCCOP(O)(O)=O
: