Target
Lysophosphatidic acid receptor 3
Ligand
BDBM50170862
Substrate
Meas. Tech.
ChEMBL_312537 (CHEMBL832580)
IC50
454±n/a nM
Citation
 Durgam, GGVirag, TWalker, MDTsukahara, RYasuda, SLiliom, Kvan Meeteren, LAMoolenaar, WHWilke, NSiess, WTigyi, GMiller, DD Synthesis, structure-activity relationships, and biological evaluation of fatty alcohol phosphates as lysophosphatidic acid receptor ligands, activators of PPARgamma, and inhibitors of autotaxin. J Med Chem 48:4919-30 (2005)  
Target
Name:
Lysophosphatidic acid receptor 3
Synonyms:
EDG7 LPAR3 Lysophosphatidic acid receptor 1/3 Lysophosphatidic acid receptor Edg-7
Type:
Enzyme
Mol. Mass.:
40149.72
Organism:
Homo sapiens (Human)
Description:
Q9UBY5
Residue:
353
  
Inhibitor
Name:
BDBM50170862
Synonyms:
CHEMBL191055 | Octanoic acid (S)-1-methyl-2-octanoyloxy-diphosphoric acid
Type:
Small organic molecule
Emp. Form.:
C19H38O11P2
Mol. Mass.:
504.4459
SMILES:
CCCCCCCC(=O)OC[C@H](COP(O)(=O)OP(O)(O)=O)OC(=O)CCCCCCC
: